Target
Pepsin A
Ligand
BDBM50010428
Substrate
Meas. Tech.
ChEBML_153980
IC50
12000±n/a nM
Citation
 Raddatz, PJonczyk, AMinck, KOSchmitges, CJSombroek, J Substrate analogue renin inhibitors containing replacements of histidine in P2 or isosteres of the amide bond between P3 and P2 sites. J Med Chem 34:3267-80 (1991)  
Target
Name:
Pepsin A
Synonyms:
PEPA_PIG Pepsin | Pepsin A precursor
Type:
Enzyme
Mol. Mass.:
41232.87
Organism:
Porcine
Description:
Residue:
385
  
Inhibitor
Name:
BDBM50010428
Synonyms:
BOC-Phe-psi[COCH2]Gly-Leu-psi-[CHOHCH2]Val-Ile N-[(4-amino-2-methyl-5-pyrimidinyl)methyl]amide | CHEMBL112778
Type:
Small organic molecule
Emp. Form.:
C41H65N7O7
Mol. Mass.:
767.9975
SMILES:
CC[C@H](C)[C@H](NC(=O)[C@@H](C[C@H](O)[C@H](CC(C)C)NC(=O)CCC(=O)[C@H](Cc1ccccc1)NC(=O)OC(C)(C)C)C(C)C)C(=O)NCc1cnc(C)nc1N
: