Target
Pepsin A
Ligand
BDBM50010421
Substrate
Meas. Tech.
ChEBML_153980
IC50
18500±n/a nM
Citation
 Raddatz, PJonczyk, AMinck, KOSchmitges, CJSombroek, J Substrate analogue renin inhibitors containing replacements of histidine in P2 or isosteres of the amide bond between P3 and P2 sites. J Med Chem 34:3267-80 (1991)  
Target
Name:
Pepsin A
Synonyms:
PEPA_PIG Pepsin | Pepsin A precursor
Type:
Enzyme
Mol. Mass.:
41232.87
Organism:
Porcine
Description:
Residue:
385
  
Inhibitor
Name:
BDBM50010421
Synonyms:
BOC-Phe-beta-Ala-ACHPA-Ile N-[(4-amino-2-methyl-5-pyrimidinyl)methyl]amide | CHEMBL110060
Type:
Small organic molecule
Emp. Form.:
C40H62N8O7
Mol. Mass.:
766.9697
SMILES:
CC[C@H](C)[C@H](NC(=O)C[C@H](O)[C@@H](CC1CCCCC1)NC(=O)CCNC(=O)[C@@H](Cc1ccccc1)NC(=O)OC(C)(C)C)C(=O)NCc1cnc(C)nc1N
: