Target
Renin
Ligand
BDBM50368157
Substrate
Meas. Tech.
ChEBML_195762
IC50
4.5±n/a nM
Citation
 Raddatz, PJonczyk, AMinck, KOSchmitges, CJSombroek, J Substrate analogue renin inhibitors containing replacements of histidine in P2 or isosteres of the amide bond between P3 and P2 sites. J Med Chem 34:3267-80 (1991)  
Target
Name:
Renin
Synonyms:
Angiotensinogenase RENI_HUMAN
Type:
Enzyme
Mol. Mass.:
45058.99
Organism:
Homo sapiens (Human)
Description:
Residue:
406
  
Inhibitor
Name:
BDBM50368157
Synonyms:
CHEMBL1203095
Type:
Small organic molecule
Emp. Form.:
C41H65N9O6
Mol. Mass.:
780.0115
SMILES:
CC[C@H](C)[C@H](NC(=O)C[C@H](O)[C@H](CC1CCCCC1)NC(=O)CCNC(=O)[C@H](Cc1ccccc1)NC(=O)CCCCCN)C(=O)NCc1cnc(C)nc1N
: