Target
Gag-Pol polyprotein [489-587]
Ligand
BDBM50005687
Substrate
Meas. Tech.
ChEMBL_160731 (CHEMBL767110)
IC50
300±n/a nM
Citation
 Krohn, ARedshaw, SRitchie, JCGraves, BJHatada, MH Novel binding mode of highly potent HIV-proteinase inhibitors incorporating the (R)-hydroxyethylamine isostere. J Med Chem 34:3340-2 (1991)  
Target
Name:
Gag-Pol polyprotein [489-587]
Synonyms:
Human immunodeficiency virus type 1 protease Pol polyprotein | gag-pol
Type:
Enzyme Subunit
Mol. Mass.:
10781.16
Organism:
Human immunodeficiency virus type 1
Description:
P04585[489-587]
Residue:
99
  
Inhibitor
Name:
BDBM50005687
Synonyms:
1-[3-(2-Benzyloxycarbonylamino-3-carbamoyl-propionylamino)-2-hydroxy-4-phenyl-butyl]-pyrrolidine-2-carboxylic acid tert-butyl ester CHEMBL115292
Type:
Small organic molecule
Emp. Form.:
C31H42N4O7
Mol. Mass.:
582.6878
SMILES:
CC(C)(C)OC(=O)[C@@H]1CCCN1C[C@H](O)[C@H](Cc1ccccc1)NC(=O)[C@H](CC(N)=O)NC(=O)OCc1ccccc1
: