Target
D(2) dopamine receptor
Ligand
BDBM50007702
Substrate
Meas. Tech.
ChEMBL_58215 (CHEMBL669945)
Ki
77.0±n/a nM
Citation
 Neumeyer, JLBaindur, NNiznik, HBGuan, HCSeeman, P (+/-)-3-Allyl-6-bromo-7,8-dihydroxy-1-phenyl-2,3,4,5-tetrahydro-1H-3- benzazepin, a new high-affinity D1 dopamine receptor ligand: synthesis and structure-activity relationship. J Med Chem 34:3366-71 (1992)  
Target
Name:
D(2) dopamine receptor
Synonyms:
D(2) dopamine receptor DOPAMINE D2 Long DRD2 Dopamine D2 receptor Dopamine D2 receptor (D2R) Dopamine2-like | d2
Type:
Cell-surface receptors
Mol. Mass.:
50647.10
Organism:
Homo sapiens (Human)
Description:
P14416
Residue:
443
  
Inhibitor
Name:
BDBM50007702
Synonyms:
6-Chloro-3-methyl-1-phenyl-2,3,4,5-tetrahydro-1H-benzo[d]azepine-7,8-diol; hydrobromide | CHEMBL543398
Type:
Small organic molecule
Emp. Form.:
C17H18ClNO2
Mol. Mass.:
303.783
SMILES:
CN1CCc2c(Cl)c(O)c(O)cc2C(C1)c1ccccc1
: