Target
D(2) dopamine receptor
Ligand
BDBM50004923
Substrate
Meas. Tech.
ChEMBL_58213 (CHEMBL669943)
Ki
8800±n/a nM
Citation
 Neumeyer, JLBaindur, NNiznik, HBGuan, HCSeeman, P (+/-)-3-Allyl-6-bromo-7,8-dihydroxy-1-phenyl-2,3,4,5-tetrahydro-1H-3- benzazepin, a new high-affinity D1 dopamine receptor ligand: synthesis and structure-activity relationship. J Med Chem 34:3366-71 (1992)  
Target
Name:
D(2) dopamine receptor
Synonyms:
D(2) dopamine receptor DOPAMINE D2 Long DRD2 Dopamine D2 receptor Dopamine D2 receptor (D2R) Dopamine2-like | d2
Type:
Cell-surface receptors
Mol. Mass.:
50647.10
Organism:
Homo sapiens (Human)
Description:
P14416
Residue:
443
  
Inhibitor
Name:
BDBM50004923
Synonyms:
(+/-)-SKF-38393 1-Phenyl-2,3,4,5-tetrahydro-1H-benzo[d]azepine-7,8-diol (SK&F 38393) 1-Phenyl-2,3,4,5-tetrahydro-1H-benzo[d]azepine-7,8-diol; hydrochloride(SKF 38393) CHEMBL505308 RS(+/-)SKF 383931-Phenyl-2,3,4,5-tetrahydro-1H-benzo[d]azepine-7,8-diol SK-38393 SKF-38393 cid_147514
Type:
Small organic molecule
Emp. Form.:
C16H17NO2
Mol. Mass.:
255.3117
SMILES:
Oc1cc2CCNCC(c3ccccc3)c2cc1O
: