Target
D(1A) dopamine receptor
Ligand
BDBM50004922
Substrate
Meas. Tech.
ChEMBL_60357 (CHEMBL672092)
Ki
5±n/a nM
Citation
 Neumeyer, JLBaindur, NNiznik, HBGuan, HCSeeman, P (+/-)-3-Allyl-6-bromo-7,8-dihydroxy-1-phenyl-2,3,4,5-tetrahydro-1H-3- benzazepin, a new high-affinity D1 dopamine receptor ligand: synthesis and structure-activity relationship. J Med Chem 34:3366-71 (1992)  
Target
Name:
D(1A) dopamine receptor
Synonyms:
DA D1 receptor DRD1 Dopamine D1 receptor Dopamine D1A
Type:
Enzyme
Mol. Mass.:
49303.43
Organism:
Homo sapiens (Human)
Description:
P21728
Residue:
446
  
Inhibitor
Name:
BDBM50004922
Synonyms:
3-Allyl-6-bromo-1-phenyl-2,3,4,5-tetrahydro-1H-benzo[d]azepine-7,8-diol; hydrobromide(Br-APB) CHEMBL544114 | RS-(+/-)-6-Br-APD3-Allyl-6-bromo-1-phenyl-2,3,4,5-tetrahydro-1H-benzo[d]azepine-7,8-diol
Type:
Small organic molecule
Emp. Form.:
C19H20BrNO2
Mol. Mass.:
374.272
SMILES:
Oc1cc2C(CN(CC=C)CCc2c(Br)c1O)c1ccccc1
: