Target
Adenosine receptor A2a
Ligand
BDBM50009525
Substrate
Meas. Tech.
ChEBML_30001
Ki
76±n/a nM
Citation
 Thompson, RDSecunda, SDaly, JWOlsson, RA Activity of N6-substituted 2-chloroadenosines at A1 and A2 adenosine receptors. J Med Chem 34:3388-90 (1992)  
Target
Name:
Adenosine receptor A2a
Synonyms:
AA2AR_RAT Adenosine A2 receptor Adenosine Receptors A2a (A2a) Adenosine receptors A2a Rat striatal adenosine A2a receptor
Type:
G Protein-Coupled Receptor (GPCR)
Mol. Mass.:
45015.65
Organism:
Rattus norvegicus (rat)
Description:
Rat A2A receptors expressed in CHO cells.
Residue:
410
  
Inhibitor
Name:
BDBM50009525
Synonyms:
2-CI Adenosine 2-Chloroado CHEMBL285819
Type:
Small organic molecule
Emp. Form.:
C10H12ClN5O4
Mol. Mass.:
301.686
SMILES:
Nc1nc(Cl)nc2n(cnc12)[C@@H]1O[C@H](CO)[C@@H](O)[C@H]1O
: