Target
Acetylcholinesterase
Ligand
BDBM50008688
Substrate
Meas. Tech.
ChEBML_29086
IC50
>900000±n/a nM
Citation
 Kozikowski, APMiller, CPYamada, FPang, YPMiller, JHMcKinney, MBall, RG Delineating the pharmacophoric elements of huperzine A: importance of the unsaturated three-carbon bridge to its AChE inhibitory activity. J Med Chem 34:3399-402 (1992)  
Target
Name:
Acetylcholinesterase
Synonyms:
ACES_RAT Acetylcholinesterase and butyrylcholinesterase (AChE and BChE) Acetylcholinesterase, AChE | Ache
Type:
Enzyme
Mol. Mass.:
68193.62
Organism:
Rattus norvegicus (rat)
Description:
P37136
Residue:
614
  
Inhibitor
Name:
BDBM50008688
Synonyms:
5-Aminomethyl-1H-pyridin-2-one | CHEMBL323807
Type:
Small organic molecule
Emp. Form.:
C6H8N2O
Mol. Mass.:
124.1405
SMILES:
NCc1ccc(=O)[nH]c1
: