Target
Dihydrofolate reductase
Ligand
BDBM50011319
Substrate
Meas. Tech.
ChEBML_54102
IC50
35±n/a nM
Citation
 Rosowsky, ABader, HFreisheim, JH Synthesis and biological activity of methotrexate analogues with two acid groups and a hydrophobic aromatic ring in the side chain. J Med Chem 34:574-9 (1991)  
Target
Name:
Dihydrofolate reductase
Synonyms:
DHFR Dihydrofolate reductase (DHFR) | Tetrahydrofolate dehydrogenase
Type:
Enzyme
Mol. Mass.:
21453.99
Organism:
Homo sapiens (Human)
Description:
Recombinant human DHFR.
Residue:
187
  
Inhibitor
Name:
BDBM50011319
Synonyms:
3-(4-Carboxy-4-{4-[(2,4-diamino-pteridin-6-ylmethyl)-methyl-amino]-benzoylamino}-butyrylamino)-benzoic acid | CHEMBL155023
Type:
Small organic molecule
Emp. Form.:
C27H27N9O6
Mol. Mass.:
573.56
SMILES:
CN(Cc1cnc2nc(N)nc(N)c2n1)c1ccc(cc1)C(=O)NC(CCC(=O)Nc1cccc(c1)C(O)=O)C(O)=O
: