Target
Adenosylhomocysteinase
Ligand
BDBM50368167
Substrate
Meas. Tech.
ChEMBL_196879 (CHEMBL807531)
Ki
1600±n/a nM
Citation
 Jarvi, ETMcCarthy, JRMehdi, SMatthews, DPEdwards, MLPrakash, NJBowlin, TLSunkara, PSBey, P 4',5'-unsaturated 5'-halogenated nucleosides. Mechanism-based and competitive inhibitors of S-adenosyl-L-homocysteine hydrolase. J Med Chem 34:647-56 (1991)  
Target
Name:
Adenosylhomocysteinase
Synonyms:
Adenosylhomocysteinase SAHH_RAT
Type:
PROTEIN
Mol. Mass.:
47537.52
Organism:
Rattus norvegicus
Description:
ChEMBL_1507790
Residue:
432
  
Inhibitor
Name:
BDBM50368167
Synonyms:
CHEMBL3349334 | CHEMBL611905
Type:
Small organic molecule
Emp. Form.:
C10H10ClN5O3
Mol. Mass.:
283.671
SMILES:
Nc1ncnc2n(cnc12)[C@@H]1O\C(=C/Cl)[C@@H](O)[C@H]1O
: