Target
Adenosylhomocysteinase
Ligand
BDBM50280299
Substrate
Meas. Tech.
ChEBML_196865
Ki
550±n/a nM
Citation
 Jarvi, ETMcCarthy, JRMehdi, SMatthews, DPEdwards, MLPrakash, NJBowlin, TLSunkara, PSBey, P 4',5'-unsaturated 5'-halogenated nucleosides. Mechanism-based and competitive inhibitors of S-adenosyl-L-homocysteine hydrolase. J Med Chem 34:647-56 (1991)  
Target
Name:
Adenosylhomocysteinase
Synonyms:
Adenosylhomocysteinase Ahcy Liver copper-binding protein SAHH_MOUSE
Type:
PROTEIN
Mol. Mass.:
47687.65
Organism:
Mus musculus
Description:
ChEMBL_196559
Residue:
432
  
Inhibitor
Name:
BDBM50280299
Synonyms:
(2R,3R,4S)-2-(6-Amino-purin-9-yl)-5-[1-fluoro-meth-(Z)-ylidene]-tetrahydro-furan-3,4-diol | CHEMBL45769
Type:
Small organic molecule
Emp. Form.:
C10H10FN5O3
Mol. Mass.:
267.2165
SMILES:
Nc1ncnc2n(cnc12)[C@@H]1O\C(=C/F)[C@@H](O)[C@H]1O
: