Target
Cytochrome P450 11B1, mitochondrial
Ligand
BDBM8611
Substrate
Meas. Tech.
ChEMBL_177198 (CHEMBL782598)
IC50
100000±n/a nM
Citation
 Browne, LJGude, CRodriguez, HSteele, REBhatnager, A Fadrozole hydrochloride: a potent, selective, nonsteroidal inhibitor of aromatase for the treatment of estrogen-dependent disease. J Med Chem 34:725-36 (1991)  
Target
Name:
Cytochrome P450 11B1, mitochondrial
Synonyms:
C11B1_RAT Cyp11b1 Cytochrome P450 11B1
Type:
PROTEIN
Mol. Mass.:
57478.87
Organism:
Rattus norvegicus
Description:
ChEMBL_1475489
Residue:
499
  
Inhibitor
Name:
BDBM8611
Synonyms:
4-{5H,6H,7H,8H-imidazo[1,5-a]pyridin-5-yl}benzonitrile CHEMBL9298 US9271963, Fadrozole
Type:
Small organic molecule
Emp. Form.:
C14H13N3
Mol. Mass.:
223.2731
SMILES:
N#Cc1ccc(cc1)C1CCCc2cncn12
: