Target
Aldo-keto reductase family 1 member A1
Ligand
BDBM50009834
Substrate
Meas. Tech.
ChEMBL_31308 (CHEMBL646326)
IC50
89000±n/a nM
Citation
 Mylari, BLBeyer, TASiegel, TW A highly specific aldose reductase inhibitor, ethyl 1-benzyl-3-hydroxy-2(5H)-oxopyrrole-4-carboxylate, and its congeners. J Med Chem 34:1011-8 (1991)  
Target
Name:
Aldo-keto reductase family 1 member A1
Synonyms:
AK1A1_PIG ALR Aldehyde reductase
Type:
PROTEIN
Mol. Mass.:
36557.09
Organism:
Sus scrofa
Description:
ChEMBL_615076
Residue:
325
  
Inhibitor
Name:
BDBM50009834
Synonyms:
2-Propylvaleric acid sodium salt Depakene Divalproex Epilim sodium 2-propylpentanoate | sodium valproate
Type:
Small organic molecule
Emp. Form.:
C8H15O2
Mol. Mass.:
143.204
SMILES:
CCCC(CCC)C([O-])=O
: