Target
Aldo-keto reductase family 1 member B1
Ligand
BDBM50009843
Substrate
Meas. Tech.
ChEMBL_31772 (CHEMBL643099)
IC50
2300±n/a nM
Citation
 Mylari, BLBeyer, TASiegel, TW A highly specific aldose reductase inhibitor, ethyl 1-benzyl-3-hydroxy-2(5H)-oxopyrrole-4-carboxylate, and its congeners. J Med Chem 34:1011-8 (1991)  
Target
Name:
Aldo-keto reductase family 1 member B1
Synonyms:
AKR1B1 ALDR_HUMAN AR Aldose Reductase (ALR2) Aldose reductase (AR)
Type:
Protein
Mol. Mass.:
35855.50
Organism:
Homo sapiens (Human)
Description:
P15121. 4LAU; 2IKI; 4LB4; 2FZD; 2FZ8; 1US0
Residue:
316
  
Inhibitor
Name:
BDBM50009843
Synonyms:
4-Hydroxy-1-naphthalen-1-ylmethyl-5-oxo-2,5-dihydro-1H-pyrrole-3-carboxylic acid ethyl ester | CHEMBL7658
Type:
Small organic molecule
Emp. Form.:
C18H17NO4
Mol. Mass.:
311.3319
SMILES:
CCOC(=O)C1CN(Cc2cccc3ccccc23)C(=O)C1=O
: