Target
Aldo-keto reductase family 1 member A1
Ligand
BDBM50009832
Substrate
Meas. Tech.
ChEMBL_31311 (CHEMBL644864)
IC50
480000±n/a nM
Citation
 Mylari, BLBeyer, TASiegel, TW A highly specific aldose reductase inhibitor, ethyl 1-benzyl-3-hydroxy-2(5H)-oxopyrrole-4-carboxylate, and its congeners. J Med Chem 34:1011-8 (1991)  
Target
Name:
Aldo-keto reductase family 1 member A1
Synonyms:
AK1A1_RAT Aldehyde reductase | Alr
Type:
PROTEIN
Mol. Mass.:
36509.97
Organism:
Rattus norvegicus
Description:
ChEMBL_31321
Residue:
325
  
Inhibitor
Name:
BDBM50009832
Synonyms:
1-Benzyl-4-hydroxy-5-oxo-2,5-dihydro-1H-pyrrole-3-carboxylic acid ethyl ester | CHEMBL269550
Type:
Small organic molecule
Emp. Form.:
C14H15NO4
Mol. Mass.:
261.2732
SMILES:
CCOC(=O)C1CN(Cc2ccccc2)C(=O)C1=O
: