Target
Aldo-keto reductase family 1 member B1
Ligand
BDBM50009777
Substrate
Meas. Tech.
ChEMBL_32093 (CHEMBL644296)
IC50
28±n/a nM
Citation
 Mylari, BLBeyer, TASiegel, TW A highly specific aldose reductase inhibitor, ethyl 1-benzyl-3-hydroxy-2(5H)-oxopyrrole-4-carboxylate, and its congeners. J Med Chem 34:1011-8 (1991)  
Target
Name:
Aldo-keto reductase family 1 member B1
Synonyms:
ALDR_RAT Akr1b4 Aldr1
Type:
PROTEIN
Mol. Mass.:
35797.87
Organism:
Rattus norvegicus
Description:
ChEMBL_1512484
Residue:
316
  
Inhibitor
Name:
BDBM50009777
Synonyms:
(ponalrestat)[3-(4-Bromo-2-fluoro-benzyl)-4-oxo-3,4-dihydro-phthalazin-1-yl]-acetic acid Ponalrestat [3-(4-Bromo-2-fluoro-benzyl)-4-oxo-3,4-dihydro-phthalazin-1-yl]-acetic acid | [3-(4-Bromo-2-fluoro-benzyl)-4-oxo-3,4-dihydro-phthalazin-1-yl]-acetic acid(ponalrestat)
Type:
Small organic molecule
Emp. Form.:
C17H12BrFN2O3
Mol. Mass.:
391.191
SMILES:
OC(=O)Cc1nn(Cc2ccc(Br)cc2F)c(=O)c2ccccc12
: