Target
Adenosine receptor A1
Ligand
BDBM50368193
Substrate
Meas. Tech.
ChEBML_29172
Ki
41±n/a nM
Citation
 Trivedi, BKBlankley, CJBristol, JAHamilton, HWPatt, WCKramer, WJJohnson, SABruns, RFCohen, DMRyan, MJ N6-substituted adenosine receptor agonists: potential antihypertensive agents. J Med Chem 34:1043-9 (1991)  
Target
Name:
Adenosine receptor A1
Synonyms:
AA1R_RAT ADENOSINE A1 high Adenosine A1 receptor (A1) Adenosine receptors A1 | Adora1
Type:
Protein
Mol. Mass.:
36704.13
Organism:
Rattus norvegicus (rat)
Description:
Residue:
326
  
Inhibitor
Name:
BDBM50368193
Synonyms:
CHEMBL2235611 | CHEMBL604769
Type:
Small organic molecule
Emp. Form.:
C19H20ClN5O4
Mol. Mass.:
417.846
SMILES:
OC[C@H]1O[C@H]([C@H](O)[C@@H]1O)n1cnc2c(NC3CCc4cc(Cl)ccc34)ncnc12
: