Target
Adenosine receptor A1
Ligand
BDBM50368183
Substrate
Meas. Tech.
ChEBML_29172
Ki
8.4±n/a nM
Citation
 Trivedi, BKBlankley, CJBristol, JAHamilton, HWPatt, WCKramer, WJJohnson, SABruns, RFCohen, DMRyan, MJ N6-substituted adenosine receptor agonists: potential antihypertensive agents. J Med Chem 34:1043-9 (1991)  
Target
Name:
Adenosine receptor A1
Synonyms:
AA1R_RAT ADENOSINE A1 high Adenosine A1 receptor (A1) Adenosine receptors A1 | Adora1
Type:
Protein
Mol. Mass.:
36704.13
Organism:
Rattus norvegicus (rat)
Description:
Residue:
326
  
Inhibitor
Name:
BDBM50368183
Synonyms:
CHEMBL604141
Type:
Small organic molecule
Emp. Form.:
C20H23N5O4
Mol. Mass.:
397.4277
SMILES:
OC[C@H]1OC([C@H](O)[C@@H]1O)n1cnc2c(NC3CCc4ccccc4C3)ncnc12
: