Target
D(1A) dopamine receptor
Ligand
BDBM50007481
Substrate
Meas. Tech.
ChEBML_58347
IC50
6600±n/a nM
Citation
 Hrib, NJJurcak, JGHuger, FPErrico, CLDunn, RW Synthesis and biological evaluation of a series of substituted N-alkoxyimides and -amides as potential atypical antipsychotic agents. J Med Chem 34:1068-72 (1991)  
Target
Name:
D(1A) dopamine receptor
Synonyms:
DOPAMINE D1 Dopamine D1 high Dopamine receptor Dopamine1-like Drd1a
Type:
Enzyme Catalytic Domain
Mol. Mass.:
49429.75
Organism:
RAT
Description:
P18901
Residue:
446
  
Inhibitor
Name:
BDBM50007481
Synonyms:
8-[3-(4-Benzo[d]isothiazol-3-yl-piperazin-1-yl)-propoxy]-8-aza-spiro[4.5]decane-7,9-dione(HCl0.5H2O) | CHEMBL276175
Type:
Small organic molecule
Emp. Form.:
C23H30N4O3S
Mol. Mass.:
442.574
SMILES:
O=C1CC2(CCCC2)CC(=O)N1OCCCN1CCN(CC1)c1nsc2ccccc12
: