Target
D(2) dopamine receptor
Ligand
BDBM50007490
Substrate
Meas. Tech.
ChEMBL_58709 (CHEMBL669055)
IC50
>20000±n/a nM
Citation
 Hrib, NJJurcak, JGHuger, FPErrico, CLDunn, RW Synthesis and biological evaluation of a series of substituted N-alkoxyimides and -amides as potential atypical antipsychotic agents. J Med Chem 34:1068-72 (1991)  
Target
Name:
D(2) dopamine receptor
Synonyms:
DOPAMINE D2 DOPAMINE D2 Short Dopamine D2 receptor Drd2
Type:
G Protein-Coupled Receptor (GPCR)
Mol. Mass.:
50931.60
Organism:
Rattus norvegicus (rat)
Description:
P61169
Residue:
444
  
Inhibitor
Name:
BDBM50007490
Synonyms:
8-[3-(4-Benzothiazol-2-yl-piperazin-1-yl)-propoxy]-8-aza-spiro[4.5]decane-7,9-dione | CHEMBL418340
Type:
Small organic molecule
Emp. Form.:
C23H30N4O3S
Mol. Mass.:
442.574
SMILES:
O=C1CC2(CCCC2)CC(=O)N1OCCCN1CCN(CC1)c1nc2ccccc2s1
: