Target
D(2) dopamine receptor
Ligand
BDBM50007495
Substrate
Meas. Tech.
ChEMBL_58709 (CHEMBL669055)
IC50
1000±n/a nM
Citation
 Hrib, NJJurcak, JGHuger, FPErrico, CLDunn, RW Synthesis and biological evaluation of a series of substituted N-alkoxyimides and -amides as potential atypical antipsychotic agents. J Med Chem 34:1068-72 (1991)  
Target
Name:
D(2) dopamine receptor
Synonyms:
DOPAMINE D2 DOPAMINE D2 Short Dopamine D2 receptor Drd2
Type:
G Protein-Coupled Receptor (GPCR)
Mol. Mass.:
50931.60
Organism:
Rattus norvegicus (rat)
Description:
P61169
Residue:
444
  
Inhibitor
Name:
BDBM50007495
Synonyms:
9-Hydroxy-8-{3-[4-(2-methoxy-phenyl)-piperazin-1-yl]-propoxy}-8-aza-spiro[4.5]decan-7-one | CHEMBL10640
Type:
Small organic molecule
Emp. Form.:
C23H35N3O4
Mol. Mass.:
417.5417
SMILES:
COc1ccccc1N1CCN(CCCON2C(O)CC3(CCCC3)CC2=O)CC1
: