Target
5-hydroxytryptamine receptor 1A
Ligand
BDBM50007479
Substrate
Meas. Tech.
ChEBML_847
IC50
>20000±n/a nM
Citation
 Hrib, NJJurcak, JGHuger, FPErrico, CLDunn, RW Synthesis and biological evaluation of a series of substituted N-alkoxyimides and -amides as potential atypical antipsychotic agents. J Med Chem 34:1068-72 (1991)  
Target
Name:
5-hydroxytryptamine receptor 1A
Synonyms:
5-HT-1A 5-HT1A 5-hydroxytryptamine receptor 1A (5HT1A) 5ht1a Htr1a Serotonin 1a (5-HT1a) receptor/Adrenergic receptor alpha-1 | Serotonin receptor 1A
Type:
G Protein-Coupled Receptor (GPCR)
Mol. Mass.:
46445.29
Organism:
Rattus norvegicus (rat)
Description:
Binding assays were performed using rat hippocampal membranes.
Residue:
422
  
Inhibitor
Name:
BDBM50007479
Synonyms:
2-{3-[4-(3-Methylsulfanyl-phenyl)-piperazin-1-yl]-propoxy}-isoindole-1,3-dione | CHEMBL10194
Type:
Small organic molecule
Emp. Form.:
C22H25N3O3S
Mol. Mass.:
411.517
SMILES:
CSc1cccc(c1)N1CCN(CCCON2C(=O)c3ccccc3C2=O)CC1
: