Target
Sigma non-opioid intracellular receptor 1
Ligand
BDBM50041276
Substrate
Meas. Tech.
ChEMBL_201271 (CHEMBL804960)
Ki
4.8±n/a nM
Citation
 Glennon, RASmith, JDIsmaiel, AMel-Ashmawy, MBattaglia, GFischer, JB Identification and exploitation of the sigma-opiate pharmacophore. J Med Chem 34:1094-8 (1991)  
Target
Name:
Sigma non-opioid intracellular receptor 1
Synonyms:
Aging-associated gene 8 protein SGMR1_HUMAN SIGMAR1 SR31747-binding protein Sigma 1-type opioid receptor Sigma1R | hSigmaR1
Type:
Enzyme Catalytic Domain
Mol. Mass.:
25124.85
Organism:
Homo sapiens (Human)
Description:
Q99720
Residue:
223
  
Inhibitor
Name:
BDBM50041276
Synonyms:
CHEMBL20302 | Methyl-((S)-1-methyl-2-phenyl-ethyl)-phenethyl-amine
Type:
Small organic molecule
Emp. Form.:
C18H23N
Mol. Mass.:
253.3819
SMILES:
C[C@@H](Cc1ccccc1)N(C)CCc1ccccc1
: