Target
Sigma non-opioid intracellular receptor 1
Ligand
BDBM50368229
Substrate
Meas. Tech.
ChEBML_201295
Ki
73±n/a nM
Citation
 Glennon, RASmith, JDIsmaiel, AMel-Ashmawy, MBattaglia, GFischer, JB Identification and exploitation of the sigma-opiate pharmacophore. J Med Chem 34:1094-8 (1991)  
Target
Name:
Sigma non-opioid intracellular receptor 1
Synonyms:
Opioid receptor SGMR1_RAT Sigma non-opioid intracellular receptor 1 Sigma-1 | Sigmar1
Type:
Enzyme Catalytic Domain
Mol. Mass.:
25266.54
Organism:
RAT
Description:
Q9R0C9
Residue:
223
  
Inhibitor
Name:
BDBM50368229
Synonyms:
CHEMBL1907647
Type:
Small organic molecule
Emp. Form.:
C18H21NO
Mol. Mass.:
267.3654
SMILES:
C[C@H](Cc1ccccc1)NCCC(=O)c1ccccc1
: