Target
Prostaglandin-H2 D-isomerase
Ligand
BDBM50009856
Substrate
Meas. Tech.
ChEBML_158157
IC50
200±n/a nM
Citation
 Bell, MRD'Ambra, TEKumar, VEissenstat, MAHerrmann, JLWetzel, JRRosi, DPhilion, REDaum, SJHlasta, DJ Antinociceptive (aminoalkyl)indoles. J Med Chem 34:1099-110 (1991)  
Target
Name:
Prostaglandin-H2 D-isomerase
Synonyms:
PTGDS_MOUSE | Ptgds
Type:
PROTEIN
Mol. Mass.:
21069.88
Organism:
Mus musculus
Description:
ChEMBL_158158
Residue:
189
  
Inhibitor
Name:
BDBM50009856
Synonyms:
CHEMBL13376 [3-(4-Chloro-benzoyl)-6-methoxy-2-methyl-indol-1-yl]-acetic acid
Type:
Small organic molecule
Emp. Form.:
C19H16ClNO4
Mol. Mass.:
357.788
SMILES:
COc1ccc2c(C(=O)c3ccc(Cl)cc3)c(C)n(CC(O)=O)c2c1
: