Target
Prostaglandin-H2 D-isomerase
Ligand
BDBM50009870
Substrate
Meas. Tech.
ChEBML_158157
IC50
18000±n/a nM
Citation
 Bell, MRD'Ambra, TEKumar, VEissenstat, MAHerrmann, JLWetzel, JRRosi, DPhilion, REDaum, SJHlasta, DJ Antinociceptive (aminoalkyl)indoles. J Med Chem 34:1099-110 (1991)  
Target
Name:
Prostaglandin-H2 D-isomerase
Synonyms:
PTGDS_MOUSE | Ptgds
Type:
PROTEIN
Mol. Mass.:
21069.88
Organism:
Mus musculus
Description:
ChEMBL_158158
Residue:
189
  
Inhibitor
Name:
BDBM50009870
Synonyms:
(2-Fluoro-phenyl)-[2-methyl-1-(2-morpholin-4-yl-ethyl)-1H-indol-3-yl]-methanone | CHEMBL427657
Type:
Small organic molecule
Emp. Form.:
C22H23FN2O2
Mol. Mass.:
366.4286
SMILES:
Cc1c(C(=O)c2ccccc2F)c2ccccc2n1CCN1CCOCC1
: