Target
Adenosine deaminase
Ligand
BDBM50011566
Substrate
Meas. Tech.
ChEBML_30806
Ki
400000±n/a nM
Citation
 Cristalli, GEleuteri, AFranchetti, PGrifantini, MVittori, SLupidi, G Adenosine deaminase inhibitors: synthesis and structure-activity relationships of imidazole analogues of erythro-9-(2-hydroxy-3-nonyl)adenine. J Med Chem 34:1187-92 (1991)  
Target
Name:
Adenosine deaminase
Synonyms:
ADA Adenosine aminohydrolase
Type:
Enzyme
Mol. Mass.:
40910.44
Organism:
Bos taurus (bovine)
Description:
Residue:
363
  
Inhibitor
Name:
BDBM50011566
Synonyms:
3-(4-Amino-pyrrolo[2,3-d]pyrimidin-7-yl)-nonan-2-ol | CHEMBL18659
Type:
Small organic molecule
Emp. Form.:
C15H24N4O
Mol. Mass.:
276.3773
SMILES:
CCCCCCC(C(C)O)n1ccc2c(N)ncnc12
: