Target
Renin
Ligand
BDBM50011696
Substrate
Meas. Tech.
ChEMBL_195927 (CHEMBL803396)
pH
7.4±n/a
IC50
10±n/a nM
Comments
extracted
Citation
 Williams, PDPerlow, DSPayne, LSHolloway, MKSiegl, PKSchorn, TWLynch, RJDoyle, JJStrouse, JFVlasuk, GP Renin inhibitors containing conformationally restricted P1-P1' dipeptide mimetics. J Med Chem 34:887-900 (1991)  
Target
Name:
Renin
Synonyms:
Angiotensinogenase RENI_HUMAN
Type:
Enzyme
Mol. Mass.:
45058.99
Organism:
Homo sapiens (Human)
Description:
Residue:
406
  
Inhibitor
Name:
BDBM50011696
Synonyms:
CHEMBL170772 | {1-[1-[1-Cyclohexylmethyl-2-(1-cyclohexyl-2-oxo-pyrrolidin-3-yl)-2-hydroxy-ethylcarbamoyl]-2-(1H-imidazol-4-yl)-ethylcarbamoyl]-2-phenyl-ethyl}-carbamic acid tert-butyl ester
Type:
Small organic molecule
Emp. Form.:
C39H58N6O6
Mol. Mass.:
706.9144
SMILES:
CC(C)(C)OC(=O)N[C@@H](Cc1ccccc1)C(=O)N[C@@H](Cc1cnc[nH]1)C(=O)N[C@@H](CC1CCCCC1)[C@@H](O)[C@@H]1CCN(C2CCCCC2)C1=O
: