Target
D(2) dopamine receptor
Ligand
BDBM50453039
Substrate
Meas. Tech.
ChEBML_61427
IC50
18.0±n/a nM
Citation
 Högberg, TStröm, Pde Paulis, TStensland, BCsöregh, ILundin, KHall, HOgren, SO Potential antipsychotic agents. 9. Synthesis and stereoselective dopamine D-2 receptor blockade of a potent class of substituted (R)-N-[(1-benzyl-2-pyrrolidinyl)methyl]benzamides. Relations to other side chain congeners. J Med Chem 34:948-55 (1991)  
Target
Name:
D(2) dopamine receptor
Synonyms:
DOPAMINE D2 DOPAMINE D2 Short Dopamine D2 receptor Drd2
Type:
G Protein-Coupled Receptor (GPCR)
Mol. Mass.:
50931.60
Organism:
Rattus norvegicus (rat)
Description:
P61169
Residue:
444
  
Inhibitor
Name:
BDBM50453039
Synonyms:
CHEMBL2096749
Type:
Small organic molecule
Emp. Form.:
C20H23BrN2O3
Mol. Mass.:
419.312
SMILES:
COc1ccc(Br)c(O)c1C(=O)NC[C@H]1CCCN1Cc1ccccc1
: