Target
D(2) dopamine receptor
Ligand
BDBM50007517
Substrate
Meas. Tech.
ChEMBL_61427 (CHEMBL671401)
IC50
1.4±n/a nM
Citation
 Högberg, TStröm, Pde Paulis, TStensland, BCsöregh, ILundin, KHall, HOgren, SO Potential antipsychotic agents. 9. Synthesis and stereoselective dopamine D-2 receptor blockade of a potent class of substituted (R)-N-[(1-benzyl-2-pyrrolidinyl)methyl]benzamides. Relations to other side chain congeners. J Med Chem 34:948-55 (1991)  
Target
Name:
D(2) dopamine receptor
Synonyms:
DOPAMINE D2 DOPAMINE D2 Short Dopamine D2 receptor Drd2
Type:
G Protein-Coupled Receptor (GPCR)
Mol. Mass.:
50931.60
Organism:
Rattus norvegicus (rat)
Description:
P61169
Residue:
444
  
Inhibitor
Name:
BDBM50007517
Synonyms:
(S)-3-bromo-N-((1-ethylpyrrolidin-2-yl)methyl)-2-hydroxy-5,6-dimethoxybenzamide CHEMBL76402
Type:
Small organic molecule
Emp. Form.:
C16H23BrN2O4
Mol. Mass.:
387.269
SMILES:
CCN1CCC[C@H]1CNC(=O)c1c(O)c(Br)cc(OC)c1OC
: