Target
D(2) dopamine receptor
Ligand
BDBM50007523
Substrate
Meas. Tech.
ChEBML_61427
IC50
52±n/a nM
Citation
 Högberg, TStröm, Pde Paulis, TStensland, BCsöregh, ILundin, KHall, HOgren, SO Potential antipsychotic agents. 9. Synthesis and stereoselective dopamine D-2 receptor blockade of a potent class of substituted (R)-N-[(1-benzyl-2-pyrrolidinyl)methyl]benzamides. Relations to other side chain congeners. J Med Chem 34:948-55 (1991)  
Target
Name:
D(2) dopamine receptor
Synonyms:
DOPAMINE D2 DOPAMINE D2 Short Dopamine D2 receptor Drd2
Type:
G Protein-Coupled Receptor (GPCR)
Mol. Mass.:
50931.60
Organism:
Rattus norvegicus (rat)
Description:
P61169
Residue:
444
  
Inhibitor
Name:
BDBM50007523
Synonyms:
CHEMBL295621 | N-(1-Ethyl-pyrrolidin-2-ylmethyl)-2,3-dimethoxy-benzamide
Type:
Small organic molecule
Emp. Form.:
C16H24N2O3
Mol. Mass.:
292.3734
SMILES:
CCN1CCC[C@H]1CNC(=O)c1cccc(OC)c1OC
: