Target
D(2) dopamine receptor
Ligand
BDBM50007528
Substrate
Meas. Tech.
ChEBML_61427
IC50
5.4±n/a nM
Citation
 Högberg, TStröm, Pde Paulis, TStensland, BCsöregh, ILundin, KHall, HOgren, SO Potential antipsychotic agents. 9. Synthesis and stereoselective dopamine D-2 receptor blockade of a potent class of substituted (R)-N-[(1-benzyl-2-pyrrolidinyl)methyl]benzamides. Relations to other side chain congeners. J Med Chem 34:948-55 (1991)  
Target
Name:
D(2) dopamine receptor
Synonyms:
DOPAMINE D2 DOPAMINE D2 Short Dopamine D2 receptor Drd2
Type:
G Protein-Coupled Receptor (GPCR)
Mol. Mass.:
50931.60
Organism:
Rattus norvegicus (rat)
Description:
P61169
Residue:
444
  
Inhibitor
Name:
BDBM50007528
Synonyms:
CHEMBL366766 | N-(1-Benzyl-piperidin-4-yl)-3,5-dichloro-2-hydroxy-6-methoxy-benzamide
Type:
Small organic molecule
Emp. Form.:
C20H22Cl2N2O3
Mol. Mass.:
409.306
SMILES:
COc1c(Cl)cc(Cl)c(O)c1C(=O)NC1CCN(Cc2ccccc2)CC1
: