Target
Delta-type opioid receptor
Ligand
BDBM50009129
Substrate
Meas. Tech.
ChEBML_145185
Ki
58±n/a nM
Citation
 Portoghese, PSGarzon-Aburbeh, ANagase, HLin, CETakemori, AE Role of the spacer in conferring kappa opioid receptor selectivity to bivalent ligands related to norbinaltorphimine. J Med Chem 34:1292-6 (1991)  
Target
Name:
Delta-type opioid receptor
Synonyms:
D-OR-1 Delta opioid receptor OPIATE Delta OPRD1 OPRK1 | opioid receptor, delta 1
Type:
G Protein-Coupled Receptor (GPCR)
Mol. Mass.:
40382.98
Organism:
Homo sapiens (Human)
Description:
Competition binding assays were carried out using membrane preparations from transfected HN9.10 cells that constitutively expressed the delta opioid receptor.
Residue:
372
  
Inhibitor
Name:
BDBM50009129
Synonyms:
binaltorphimine(BNI)
Type:
Small organic molecule
Emp. Form.:
C41H45N3O6
Mol. Mass.:
675.8125
SMILES:
Cn1c2[C@@H]3Oc4c5c(CC6N(CC7CC7)CC[C@@]35[C@@]6(O)Cc2c2C[C@@]3(O)C5Cc6ccc(O)c7O[C@@H](c12)[C@]3(CCN5CC1CC1)c67)ccc4O
: