Target
Mu-type opioid receptor
Ligand
BDBM82551
Substrate
Meas. Tech.
ChEBML_145153
Ki
47±n/a nM
Citation
 Portoghese, PSGarzon-Aburbeh, ANagase, HLin, CETakemori, AE Role of the spacer in conferring kappa opioid receptor selectivity to bivalent ligands related to norbinaltorphimine. J Med Chem 34:1292-6 (1991)  
Target
Name:
Mu-type opioid receptor
Synonyms:
M-OR-1 Mu opioid receptor OPIATE Mu OPRM_CAVPO
Type:
Enzyme Catalytic Domain
Mol. Mass.:
11165.58
Organism:
GUINEA PIG
Description:
P97266
Residue:
98
  
Inhibitor
Name:
BDBM82551
Synonyms:
C18130 NOR-BNI (HCI)2 | NORBNI
Type:
Small organic molecule
Emp. Form.:
C40H43N3O6
Mol. Mass.:
661.7859
SMILES:
Oc1ccc2C[C@H]3N(CC4CC4)CC[C@@]45[C@@H](Oc1c24)c1[nH]c2[C@@H]4Oc6c7c(C[C@H]8N(CC9CC9)CC[C@@]47[C@@]8(O)Cc2c1C[C@@]35O)ccc6O
: