Target
Thymidylate synthase
Ligand
BDBM50012025
Substrate
Meas. Tech.
ChEBML_209797
IC50
580±n/a nM
Citation
 Marsham, PRHughes, LRJackman, ALHayter, AJOldfield, JWardleworth, JMBishop, JAO'Connor, BMCalvert, AH Quinazoline antifolate thymidylate synthase inhibitors: heterocyclic benzoyl ring modifications. J Med Chem 34:1594-605 (1991)  
Target
Name:
Thymidylate synthase
Synonyms:
TS TYSY_MOUSE | Tyms
Type:
PROTEIN
Mol. Mass.:
34957.15
Organism:
Mus musculus
Description:
ChEMBL_1340097
Residue:
307
  
Inhibitor
Name:
BDBM50012025
Synonyms:
2-({5-[Ethyl-(2-methyl-4-oxo-3,4-dihydro-quinazolin-6-ylmethyl)-amino]-thiophene-2-carbonyl}-amino)-pentanedioic acid | CHEMBL40851
Type:
Small organic molecule
Emp. Form.:
C22H24N4O6S
Mol. Mass.:
472.514
SMILES:
CCN(Cc1ccc2nc(C)[nH]c(=O)c2c1)c1ccc(s1)C(=O)N[C@H](CCC(O)=O)C(O)=O
: