Target
Thymidylate synthase
Ligand
BDBM50012045
Substrate
Meas. Tech.
ChEBML_209797
IC50
260±n/a nM
Citation
 Marsham, PRHughes, LRJackman, ALHayter, AJOldfield, JWardleworth, JMBishop, JAO'Connor, BMCalvert, AH Quinazoline antifolate thymidylate synthase inhibitors: heterocyclic benzoyl ring modifications. J Med Chem 34:1594-605 (1991)  
Target
Name:
Thymidylate synthase
Synonyms:
TS TYSY_MOUSE | Tyms
Type:
PROTEIN
Mol. Mass.:
34957.15
Organism:
Mus musculus
Description:
ChEMBL_1340097
Residue:
307
  
Inhibitor
Name:
BDBM50012045
Synonyms:
(S)-2-(4-(ethyl((2-methyl-4-oxo-3,4-dihydroquinazolin-6-yl)methyl)amino)benzamido)pentanedioic acid CHEMBL44037
Type:
Small organic molecule
Emp. Form.:
C24H26N4O6
Mol. Mass.:
466.4864
SMILES:
CCN(Cc1ccc2nc(C)[nH]c(=O)c2c1)c1ccc(cc1)C(=O)N[C@@H](CCC(O)=O)C(O)=O
: