Target
Kappa-type opioid receptor
Ligand
BDBM50009222
Substrate
Meas. Tech.
ChEBML_145229
Ki
6.2±n/a nM
Citation
 Portoghese, PSNagase, HMaloneyHuss, KELin, CETakemori, AE Role of spacer and address components in peptidomimetic delta opioid receptor antagonists related to naltrindole. J Med Chem 34:1715-20 (1991)  
Target
Name:
Kappa-type opioid receptor
Synonyms:
Kappa Opioid Receptor OPRK1 Opiate Kappa 1 | mu/kappa opioid receptor
Type:
G Protein-Coupled Receptor (GPCR)
Mol. Mass.:
42744.99
Organism:
Cavia porcellus (domestic guinea pig)
Description:
P41144
Residue:
380
  
Inhibitor
Name:
BDBM50009222
Synonyms:
4-cyclopropylmethyl-14-(1H-3-indolyl)-(1S,13S,17S)-12-oxa-4-azapentacyclo[9.6.1.01,13.05,17.07,18]octadeca-7(18),8,10,14-tetraene-10,17-diol
Type:
Small organic molecule
Emp. Form.:
C28H28N2O3
Mol. Mass.:
440.5335
SMILES:
Oc1ccc2CC3N(CC4CC4)CC[C@@]45[C@@H](Oc1c24)C(=CC[C@@]35O)c1c[nH]c2ccccc12
: