Target
Substance-P receptor
Ligand
BDBM50002462
Substrate
Meas. Tech.
ChEMBL_208667 (CHEMBL813326)
Kd
0.180000±n/a nM
Citation
 Appell, KCBabb, BEGoswami, RHall, PLLawrence, KBLogan, MEPrzyklek-Elling, RTomczuk, BEVenepalli, BRYanni, JM Imidazo[4,5-b]quinoxaline cyanines as neurokinin antagonists. J Med Chem 34:1751-3 (1991)  
Target
Name:
Substance-P receptor
Synonyms:
NK-1 receptor NK1 Receptor Neurokinin 1 receptor SPR Tac1r Tacr1
Type:
G Protein-Coupled Receptor (GPCR)
Mol. Mass.:
46371.54
Organism:
Rattus norvegicus (rat)
Description:
Competition binding assays were carried out using membrane preparations from transfected CHO cells that constitutively expressed the rat NK1 receptor.
Residue:
407
  
Inhibitor
Name:
BDBM50002462
Synonyms:
1,3-Diethyl-2-[3-(1,3,3-trimethyl-1,3-dihydro-indol-2-ylidene)-propenyl]-3H-imidazo[4,5-b]quinoxalin-1-ium; chloride CHEMBL278294
Type:
Small organic molecule
Emp. Form.:
C27H30N5
Mol. Mass.:
424.5601
SMILES:
CCn1c(\C=C\C=C2/N(C)c3ccccc3C2(C)C)[n+](CC)c2nc3ccccc3nc12
: