Target
Mu-type opioid receptor
Ligand
BDBM50006947
Substrate
Meas. Tech.
ChEMBL_145287 (CHEMBL752956)
Ki
19±n/a nM
Citation
 Portoghese, PS An approach to the design of receptor-type-selective non-peptide antagonists of peptidergic receptors: delta opioid antagonists. J Med Chem 34:1757-62 (1991)  
Target
Name:
Mu-type opioid receptor
Synonyms:
M-OR-1 Mu opioid receptor OPIATE Mu OPRM_CAVPO
Type:
Enzyme Catalytic Domain
Mol. Mass.:
11165.58
Organism:
GUINEA PIG
Description:
P97266
Residue:
98
  
Inhibitor
Name:
BDBM50006947
Synonyms:
22-cyclopropylmethyl-(1S,2S,13R)-11,14-dioxa-22-azaheptacyclo[13.9.1.01,13.02,21.04,12.05,10.019,25]pentacosa-4(12),5(10),6,8,15,17,19(25)-heptaene-2,16-diol | 22-cyclopropylmethyl-11,14-dioxa-22-azaheptacyclo[13.9.1.01,13.02,21.04,12.05,10.019,25]pentacosa-4(12),5(10),6,8,15,17,19(25)-heptaene-2,16-diol
Type:
Small organic molecule
Emp. Form.:
C26H25NO4
Mol. Mass.:
415.481
SMILES:
Oc1ccc2CC3N(CC4CC4)CC[C@@]45[C@@H](Oc1c24)c1oc2ccccc2c1C[C@@]35O
: