Target
Delta-type opioid receptor
Ligand
BDBM50453048
Substrate
Meas. Tech.
ChEMBL_146771 (CHEMBL755214)
IC50
1420±n/a nM
Citation
 Hruby, VJToth, GGehrig, CAKao, LFKnapp, RLui, GKYamamura, HIKramer, THDavis, PBurks, TF Topographically designed analogues of [D-Pen,D-Pen5]enkephalin. J Med Chem 34:1823-30 (1991)  
Target
Name:
Delta-type opioid receptor
Synonyms:
Cytochrome P450 3A4 Delta opioid receptor Delta-type opioid receptor (DOR) OPRD_RAT Opioid receptor Opioid receptors; mu & delta Ror-a | Voltage-gated potassium channel
Type:
G Protein-Coupled Receptor (GPCR)
Mol. Mass.:
40465.04
Organism:
Rattus norvegicus (rat)
Description:
Competition binding assays were using CHO-K1 cell membranes expressing the opioid receptor.
Residue:
372
  
Inhibitor
Name:
BDBM50453048
Synonyms:
CHEMBL2115042
Type:
Small organic molecule
Emp. Form.:
C31H41N5O7S2
Mol. Mass.:
659.817
SMILES:
[H][C@@]1(NC(=O)CNC(=O)[C@@H](NC(=O)[C@@H](N)Cc2ccc(O)cc2)C(C)(C)SSC(C)(C)[C@H](NC1=O)C(O)=O)[C@H](C)c1ccccc1
: