Target
Cathepsin D
Ligand
BDBM50012251
Substrate
Meas. Tech.
ChEBML_44985
IC50
51800±n/a nM
Citation
 Repine, JTHimmelsbach, RJHodges, JCKaltenbronn, JSSircar, ISkeean, RWBrennan, STHurley, TRLunney, EHumblet, CC Renin inhibitors containing esters at the P2-position. Oral activity in a derivative of methyl aminomalonate. J Med Chem 34:1935-43 (1991)  
Target
Name:
Cathepsin D
Synonyms:
CATD_BOVIN | CTSD
Type:
PROTEIN
Mol. Mass.:
42158.92
Organism:
Bos taurus
Description:
ChEMBL_1458606
Residue:
387
  
Inhibitor
Name:
BDBM50012251
Synonyms:
2-{2-(1-Cyclohexylmethyl-2,3-dihydroxy-5-methyl-hexylcarbamoyl)-2-[2-(morpholine-4-sulfonylamino)-3-phenyl-propionylamino]-acetylamino}-3-(1H-imidazol-4-yl)-propionic acid | CHEMBL292677
Type:
Small organic molecule
Emp. Form.:
C36H55N7O10S
Mol. Mass.:
777.928
SMILES:
CC(C)C[C@@H](O)[C@H](O)[C@H](CC1CCCCC1)NC(=O)C(NC(=O)[C@H](Cc1ccccc1)NS(=O)(=O)N1CCOCC1)C(=O)NC(Cc1cnc[nH]1)C(O)=O
: