Target
Renin
Ligand
BDBM50012252
Substrate
Meas. Tech.
ChEBML_192887
IC50
0.950000±n/a nM
Citation
 Repine, JTHimmelsbach, RJHodges, JCKaltenbronn, JSSircar, ISkeean, RWBrennan, STHurley, TRLunney, EHumblet, CC Renin inhibitors containing esters at the P2-position. Oral activity in a derivative of methyl aminomalonate. J Med Chem 34:1935-43 (1991)  
Target
Name:
Renin
Synonyms:
Angiotensinogenase RENI_HUMAN
Type:
Enzyme
Mol. Mass.:
45058.99
Organism:
Homo sapiens (Human)
Description:
Residue:
406
  
Inhibitor
Name:
BDBM50012252
Synonyms:
CHEMBL57492 | N-(1-Cyclohexylmethyl-2,3-dihydroxy-5-methyl-hexyl)-2-[2-(morpholine-4-sulfonylamino)-3-phenyl-propionylamino]-malonamic acid allyl ester
Type:
Small organic molecule
Emp. Form.:
C33H52N4O9S
Mol. Mass.:
680.852
SMILES:
CC(C)C[C@@H](O)[C@H](O)[C@H](CC1CCCCC1)NC(=O)C(NC(=O)[C@H](Cc1ccccc1)NS(=O)(=O)N1CCOCC1)C(=O)OCC=C
: