Target
Adenosine deaminase
Ligand
BDBM50012528
Substrate
Meas. Tech.
ChEBML_30795
Ki
270±n/a nM
Citation
 Cristalli, GVittori, SEleuteri, AGrifantini, MVolpini, RLupidi, GCapolongo, LPesenti, E Purine and 1-deazapurine ribonucleosides and deoxyribonucleosides: synthesis and biological activity. J Med Chem 34:2226-30 (1991)  
Target
Name:
Adenosine deaminase
Synonyms:
ADA Adenosine aminohydrolase
Type:
Enzyme
Mol. Mass.:
40910.44
Organism:
Bos taurus (bovine)
Description:
Residue:
363
  
Inhibitor
Name:
BDBM50012528
Synonyms:
5-(7-Hydroxyamino-imidazo[4,5-b]pyridin-3-yl)-2-hydroxymethyl-tetrahydro-furan-3-ol | CHEMBL3142245
Type:
Small organic molecule
Emp. Form.:
C11H14N4O4
Mol. Mass.:
266.2533
SMILES:
OC[C@H]1O[C@H](C[C@@H]1O)n1cnc2c(NO)ccnc12
: