Target
Gag-Pol polyprotein [489-587]
Ligand
BDBM50009245
Substrate
Meas. Tech.
ChEMBL_157875 (CHEMBL763270)
Ki
450±n/a nM
Citation
 Huff, JR HIV protease: a novel chemotherapeutic target for AIDS. J Med Chem 34:2305-14 (1991)  
Target
Name:
Gag-Pol polyprotein [489-587]
Synonyms:
Human immunodeficiency virus type 1 protease Pol polyprotein | gag-pol
Type:
Enzyme Subunit
Mol. Mass.:
10781.16
Organism:
Human immunodeficiency virus type 1
Description:
P04585[489-587]
Residue:
99
  
Inhibitor
Name:
BDBM50009245
Synonyms:
2-[1-[1-carbamoyl-2-methyl-(1S)-propylcarbamoyl]-2-methyl-(1S)-propylcarbamoyl]tetrahydro-1H-1-pyrrolylmethyl[2-phenyl-1-phenylcarboxamido-(1S)-ethyl]phosphinic acid | CHEMBL306261
Type:
Small organic molecule
Emp. Form.:
C31H44N5O6P
Mol. Mass.:
613.6847
SMILES:
CC(C)[C@H](NC(=O)[C@@H](NC(=O)C1CCCN1CP(O)(=O)[C@@H](Cc1ccccc1)NC(=O)c1ccccc1)C(C)C)C(N)=O
: