Target
Tyrosine-protein kinase ABL1/ABL2
Ligand
BDBM50229412
Substrate
Meas. Tech.
ChEMBL_226189 (CHEMBL846555)
IC50
100000±n/a nM
Citation
 Traxler, PMWacker, OBach, HLGeissler, JFKump, WMeyer, TRegenass, URoesel, JLLydon, N Sulfonylbenzoyl-nitrostyrenes: potential bisubstrate type inhibitors of the EGF-receptor tyrosine protein kinase. J Med Chem 34:2328-37 (1991)  
Target
Name:
Tyrosine-protein kinase ABL1/ABL2
Synonyms:
Tyrosine-protein kinase ABL
Type:
Mol. Mass.:
Description:
ASSAY_ID of EBI is 226000
Components:
This complex has 2 components.
Component 1
Name:
Tyrosine-protein kinase ABL1
Synonyms:
ABL ABL1_HUMAN JTK7 Proto-oncogene tyrosine-protein kinase ABL1 Tyrosine-protein kinase ABL V-abl Abelson murine leukemia viral oncogene homolog 1 p150 | tyrosine-protein kinase ABL1 isoform a
Type:
Enzyme
Mol. Mass.:
122897.30
Organism:
Homo sapiens (Human)
Description:
P00519
Residue:
1130
  
Component 2
Name:
Tyrosine-protein kinase ABL2
Synonyms:
ABL2 ABLL Abelson murine leukemia viral oncogene homolog 2 Tyrosine kinase ARG | VHL/Tyrosine-protein kinase ABL2
Type:
PROTEIN
Mol. Mass.:
128360.63
Organism:
Homo sapiens (Human)
Description:
ChEMBL_325082
Residue:
1182
  
Inhibitor
Name:
BDBM50229412
Synonyms:
CHEMBL453502
Type:
Small organic molecule
Emp. Form.:
C26H24N6O11S
Mol. Mass.:
628.567
SMILES:
COc1cc(\C=C\[N+]([O-])=O)ccc1OS(=O)(=O)c1ccc(cc1)C(=O)OC[C@H]1O[C@H]([C@H](O)[C@@H]1O)n1cnc2c(N)ncnc12
: