Target
Epidermal growth factor receptor
Ligand
BDBM50007084
Substrate
Meas. Tech.
ChEBML_66717
IC50
4000±n/a nM
Citation
 Traxler, PMWacker, OBach, HLGeissler, JFKump, WMeyer, TRegenass, URoesel, JLLydon, N Sulfonylbenzoyl-nitrostyrenes: potential bisubstrate type inhibitors of the EGF-receptor tyrosine protein kinase. J Med Chem 34:2328-37 (1991)  
Target
Name:
Epidermal growth factor receptor
Synonyms:
EGF Receptor Substrate EGFR_HUMAN ERBB1 Epidermal Growth Factor Receptor erbB-1 Epidermal growth factor receptor (EGFR) HER1 Proto-oncogene c-ErbB-1 Tyrosine-Protein Kinase ErbB-1
Type:
Receptor Kinase Domain
Mol. Mass.:
134279.59
Organism:
Homo sapiens (Human)
Description:
P00533
Residue:
1210
  
Inhibitor
Name:
BDBM50007084
Synonyms:
2-methoxy-4-(2-nitroprop-1-enyl)phenyl 4-(methylcarbamoyl)benzenesulfonate CHEMBL78280
Type:
Small organic molecule
Emp. Form.:
C18H18N2O7S
Mol. Mass.:
406.41
SMILES:
CNC(=O)c1ccc(cc1)[S+]([O-])(=O)Oc1ccc(\C=C(/C)[N+]([O-])=O)cc1OC
: