Target
Glucocorticoid receptor
Ligand
BDBM50009403
Substrate
Meas. Tech.
ChEBML_71420
IC50
9.7±n/a nM
Citation
 Ueno, HMaruyama, AMiyake, MNakao, ENakao, KUmezu, KNitta, I Synthesis and evaluation of antiinflammatory activities of a series of corticosteroid 17 alpha-esters containing a functional group. J Med Chem 34:2468-73 (1991)  
Target
Name:
Glucocorticoid receptor
Synonyms:
GCR_RAT Glucocorticoid Receptor (GR) Grl | Nr3c1
Type:
Enzyme Catalytic Domain
Mol. Mass.:
87556.83
Organism:
RAT
Description:
Glucocorticoid 0 RAT::P06536
Residue:
795
  
Inhibitor
Name:
BDBM50009403
Synonyms:
CHEMBL81387 | Pentanedioic acid 17-(2-chloro-acetyl)-9-fluoro-11-hydroxy-10,13,16-trimethyl-3-oxo-6,7,8,9,10,11,12,13,14,15,16,17-dodecahydro-3H-cyclopenta[a]phenanthren-17-yl ester ethyl ester
Type:
Small organic molecule
Emp. Form.:
C29H38ClFO7
Mol. Mass.:
553.059
SMILES:
CCOC(=O)CCCC(=O)O[C@@]1([C@@H](C)CC2C3CCC4=CC(=O)C=CC4(C)[C@@]3(F)[C@@H](O)CC12C)C(=O)CCl
: