Target
Aromatase
Ligand
BDBM50009438
Substrate
Meas. Tech.
ChEBML_50722
IC50
100000±n/a nM
Citation
 Numazawa, MMutsumi, AHoshi, KOshibe, MIshikawa, EKigawa, H Synthesis and biochemical studies of 16- or 19-substituted androst-4-enes as aromatase inhibitors. J Med Chem 34:2496-504 (1991)  
Target
Name:
Aromatase
Synonyms:
ARO1 CP19A_HUMAN CYP19 CYPXIX Cytochrome P450 19A1 Cytochrome P450-C19 (CYP19) FL cytokine receptor precursor | P-450AROM
Type:
Enzyme
Mol. Mass.:
57888.92
Organism:
Homo sapiens (Human)
Description:
P11511
Residue:
503
  
Inhibitor
Name:
BDBM50009438
Synonyms:
Acetic acid 10-hydroxymethyl-13-methyl-2,3,6,7,8,9,10,11,12,13,14,15,16,17-tetradecahydro-1H-cyclopenta[a]phenanthren-17-yl ester | CHEMBL81255
Type:
Small organic molecule
Emp. Form.:
C21H32O3
Mol. Mass.:
332.477
SMILES:
CC(=O)OC1CCC2C3CCC4=CCCCC4(CO)C3CCC12C
: