Target
Aromatase
Ligand
BDBM50009430
Substrate
Meas. Tech.
ChEBML_50722
IC50
4100±n/a nM
Citation
 Numazawa, MMutsumi, AHoshi, KOshibe, MIshikawa, EKigawa, H Synthesis and biochemical studies of 16- or 19-substituted androst-4-enes as aromatase inhibitors. J Med Chem 34:2496-504 (1991)  
Target
Name:
Aromatase
Synonyms:
ARO1 CP19A_HUMAN CYP19 CYPXIX Cytochrome P450 19A1 Cytochrome P450-C19 (CYP19) FL cytokine receptor precursor | P-450AROM
Type:
Enzyme
Mol. Mass.:
57888.92
Organism:
Homo sapiens (Human)
Description:
P11511
Residue:
503
  
Inhibitor
Name:
BDBM50009430
Synonyms:
16-Bromo-10,13-dimethyl-1,2,3,6,7,8,9,10,11,12,13,14,15,16-tetradecahydro-cyclopenta[a]phenanthren-17-one | CHEMBL83422
Type:
Small organic molecule
Emp. Form.:
C19H27BrO
Mol. Mass.:
351.321
SMILES:
CC12CCC3C(CCC4=CCCCC34C)C1C[C@@H](Br)C2=O
: